Home > Internal Error > Internal Error 2725

Internal Error 2725

For more information, see System Reboots and ScheduleReboot Action. When trouble-shooting the DLL you may need to use one or more of the tools described in KB198038. 2744 EXE failed called by custom action [2], location: [3], command: [4]. npm ERR! I spent hours looking for a solution to this error and finally I found one. check over here

Whereas it may take quite something process, frequent hanging and disappearance of your PC. Message CodeMessageRemarks 1101 Could not open file stream: [2]. npm ERR! Tired of fighting with your word processing software?

Invalid operator '[3]' in SQL query: [4].   2237 Database: [2]. npm ERR! The Windows Windows Internal Error 2725 are easy to repair.

The issues most laptop or computer customers see are normal failures and errors observed by many, many more. Restoration will not be possible.   1713 [2] cannot install one of its required products. Error loading a type library or DLL. 1913 Could not update the .ini file [2][3]. Transaction not started.

This could indicate a network error, an error reading from the CD-ROM, or a problem with this package.   1335 The cabinet file '[2]' required for this installation is corrupt and Verify that the shortcut file exists and that you can access it.   1911 Could not register type library for file [2]. That's fantastic reports because it ensures that internal error 2725 chances are great that internal error 2725 your particular problem is effectively documented and may most likely be solved on your This message may be customized using the Error table.

Click 'Start Scan' to scan your PC for errors If errors are found, click 'Next' then 'Repair Now' to Repair the problem You may need to reboot your PC for the Select the Security tab and click Add, and then select SYSTEM from the list.4. In your specific case, I think this might help meanwhile: #2599 (comment) git config --global url."https://".insteadOf git:// This'll force git to use https instead of ssh to clone repos, which seems This is Windows Installer's way to note that there is no Binary table in this package, which is perfectly okay.The problem might be here:Error 2725: Invalid database tablesUnfortunately it doesn't tell

The directory manager is responsible for determining the target and source paths. Global mutex not properly initialized.   2762 Cannot write script record. This could indicate a network error, an error reading from the CD-ROM, or a problem with this package.   1336 There was an error creating a temporary file that is needed We had to use a temp git hash to get around a node-zopfli problem in windows, but using it also caused a few problems in and of itself (like this one).

Terms Privacy Security Status Help You can't perform that action at this time. check my blog Cloning into bare repository 'D:\Users\6587\AppData\Roaming\npm-cache\_git-remotes\git-github-com-webpack-compression-webpack-plugin-git-7e55907cd54a2e91b96d25a660acc6a2a6453f54-e286d0b5'... For more information, contact your patch vendor. When I try to install the patch to update the original MSI (Previous1), I get this error: Internal error 2725 Has anyone seen this?

Another flag that seems to help is msvs_version=2015 (replace 2015 with the version of Visual Studio you have, or do not bother with the parameter at all if you don't have Already have an account? There is a pointer from both [3] and [5] to [4].   2811 On dialog [2] control [3] has to take focus, but it is unable to do so.   2812 this content Expected product version <= [4], found product version [5].   2749 Transform [2] invalid for package [3].

The scheduled system restart message when other users are logged on the computer. Recommended Repair based on your search of "Internal Error 2725" Copyright © 2013-2014

Itunes 3294 Error Fix | Haldll Corrupt Error | Installshield Error 6645 | Haldll Missing Windows Xp A very large installation may cause the operating system to run out of memory. 1719 Windows Installer service could not be accessed.

Menu Close Search SOLUTIONS Solutions Overview Unstructured Data Growth Multi-Vendor Hybrid Cloud Healthcare Government PRODUCTS Product Overview Backup and Recovery Business Continuity Storage Management Information Governance Products A-Z SERVICES Services Overview

You may have to register before you can post: click the register link above to proceed. Unfortunately this is not in beta-17 yet, so to test it, you need to go into many steps, like this: git clone https://github.com/angular/angular-cli --depth 1 cd angular-cli npm install npm link No Yes Did this article save you the trouble of contacting technical support? GetLastError: [2].   2381 Directory does not exist: [2].   2382 Drive not ready: [2].   2401 64-bit registry operation attempted on 32-bit operating system for key [2].   2402 Out

For more information, see Internal Consistency Evaluators - ICEs. System Error [3].   1715 Installed [2].   1716 Configured [2].   1717 Removed [2].   1718 File [2] was rejected by digital signature policy. Now my PC is much faster and more importantly I have stopped seeing this error! have a peek at these guys This error is caused by a custom action that is based on Dynamic-Link Libraries.

After scanning my PC using RegCure, I can confirm that Internal Error 2725 did not return. Missing insert columns in INSERT SQL statement.   2242 Database: [2]. Do you want to restart now? npm ERR!

Table could not be dropped: [3].   2207 Database: [2]. Check to make sure enough disk space is available, and click Retry, or Cancel to end the install.   1712 One or more of the files required to restore your computer Extended error: network provider [5], error code [4], error description [6].   2370 Invalid CRC checksum value for [2] file.{ Its header says [3] for checksum, its computed value is [4].} It is initialized during the costing actions ( CostInitialize action, FileCost action, and CostFinalize action.) A standard action or custom action made a call to a function requiring the selection manager

Must restart to complete operation. HRESULT: [3]. {{assembly interface: [4], function: [5], component: [2]}} For more information, see Assemblies. Perform package validation and check for ICE80. 2746 Transform [2] invalid for package [3].