Home > Internal Compiler > Internal Compiler Error Segmentation Fault Android

Internal Compiler Error Segmentation Fault Android

Contents

more hot questions question feed about us tour help blog chat data legal privacy policy work here advertising info mobile contact us feedback Technology Life / Arts Culture / Recreation Science Or some of the other. Reload to refresh your session. Also please make sure the 4.7.2 you're building is unmodified. weblink

You signed out in another tab or window. Affecting: gcc-4.1 (Ubuntu) Filed here by: vlk When: 2007-10-08 Confirmed: 2008-05-09 Started work: 2008-05-09 Completed: 2008-05-09 Target Distribution Baltix BOSS Juju Charms Collection Elbuntu Guadalinex Guadalinex Edu Kiwi Linux nUbuntu PLD Code: $ gcc --version gcc (Ubuntu 4.3.2-1ubuntu12) 4.3.2 Copyright (C) 2008 Free Software Foundation, Inc. Is foreign stock considered more risky than local stock and why?

Internal Compiler Error Segmentation Fault Android

See for instructions. --- SIGCHLD (Child exited) @ 0 (0) --- I've also confirmed the same behavior on another system running the same OS and gcc version, so my RAM Comment 5 Mikael Pettersson 2014-05-24 19:28:40 UTC The failure of gcc-4.8.0 and later to build gcc-4.7.2 w/ --disable-bootstrap started with r186592. Is your setup a dapper that you have upgraded all the way through the different versions? I now think you mean /usr/lib/gcc/x86_64-linux-gnu/4.6/cc1 from the cpp-4.6 package - was it absent?

  1. Comment 16 Richard Biener 2010-04-22 11:25:22 UTC This has been fixed on the 4.4 branch, I can reproduce it with 4.4.3.
  2. Hit a curb; chewed up rim and took a chunk out of tire.
  3. This does not happen on i386 binary of the same version.
  4. mingw32-make.exe[2]: *** [src/BulletCollision/CMakeFiles/BulletCollision.dir/CollisionDispatch/btInternalEdgeUtility.obj] Error 1 mingw32-make.exe[1]: *** [src/BulletCollision/CMakeFiles/BulletCollision.dir/all] Error 2 mingw32-make.exe: *** [all] Error 2 mingw32-make.exe[2]: Leaving directory `D:/DevLibs/bullet-read-only/build-cb' mingw32-make.exe[1]: Leaving directory `D:/DevLibs/bullet-read-only/build-cb' Process terminated with status 2 (1 minute(s), 14
  5. Email me if you got further questions.
  6. more stack exchange communities company blog Stack Exchange Inbox Reputation and Badges sign up log in tour help Tour Start here for a quick overview of the site Help Center Detailed
  7. Best regards, Jan Comment 14 Jan Oberländer 2010-04-22 09:19:00 UTC (In reply to comment #13) Oh, and another thing: at the moment of the segfault, memory usage says $ ps v
  8. Join them; it only takes a minute: Sign up Here's how it works: Anybody can ask a question Anybody can answer The best answers are voted up and rise to the
  9. Oh and I meant sudo apt-get install --reinstall gcc gcc-4.6 gcc-4.6-base libgcc1 in my previous comment. (there's no such action as apt-get reinstall.) –gertvdijk Jun 26 '13 at 9:36 1

Does somebody have an idea to fix this problem? So the command sudo apt-get install --reinstall gcc gcc-4.8 gcc-4.8-base libgcc1 cpp-4.8 did the trick –Amadu Bah Jun 1 '14 at 10:36 add a comment| Your Answer draft saved draft Issuing 'make oldconfig' or 'make menuconfig' leaves me with the beforementiones error. Am I doing something wrong?

But I haven't the time to wait. –Korbi Apr 4 '14 at 10:22 add a comment| Your Answer draft saved draft discarded Sign up or log in Sign up using C++: Internal Compiler Error: Segmentation Fault (program Cc1plus) Opencv I've got this on Fedora 20: $ gcc -v Using built-in specs. Not the answer you're looking for? https://gcc.gnu.org/bugzilla/show_bug.cgi?id=43818 Will they need replacement?

D:\Dev\CMake\bin\cmake.exe -E cmake_progress_report D:\DevLibs\bullet-read-only\build-cb\CMakeFiles 19 [ 25%] Building CXX object src/BulletCollision/CMakeFiles/BulletCollision.dir/CollisionDispatch/btHashedSimplePairCache.obj cd /d D:\DevLibs\bullet-read-only\build-cb\src\BulletCollision && D:\Dev\MinGW\bin\g++.exe -DUSE_GRAPHICAL_BENCHMARK -D_CRT_SECURE_NO_DEPRECATE -D_CRT_SECURE_NO_WARNINGS -D_IRR_STATIC_LIB_ -D_SCL_SECURE_NO_WARNINGS -O3 -DNDEBUG @CMakeFiles/BulletCollision.dir/includes_CXX.rsp -o CMakeFiles\BulletCollision.dir\CollisionDispatch\btHashedSimplePairCache.obj -c D:\DevLibs\bullet-read-only\src\BulletCollision\CollisionDispatch\btHashedSimplePairCache.cpp D:\Dev\CMake\bin\cmake.exe -E cmake_progress_report Here we are, trapped in the amber of the moment. Browse other questions tagged linux gcc segmentation-fault or ask your own question. Thanks. –Korbi Apr 8 '14 at 11:57 add a comment| 1 Answer 1 active oldest votes up vote -3 down vote The fix is easy: Write a bug report, find out

C++: Internal Compiler Error: Segmentation Fault (program Cc1plus) Opencv

Try these (from the same place): Code: gcc-4.1 -v hello.c Code: gcc-4.2 -v hello.c Just in case, post all output, not just failures. http://stackoverflow.com/questions/24079072/internal-compiler-error-segmentation-fault-in-gcc-when-sending-variadic-templ Browse other questions tagged 12.04 64-bit compiling gcc segmentation-fault or ask your own question. Internal Compiler Error Segmentation Fault Android Start building. Libgcc Internal Compiler Error Segmentation Fault See full activity log To post a comment you must log in.

Comment 6 Jan Oberländer 2010-04-21 11:48:06 UTC A test with a g++-4.4.2 I built myself has the same problem: $ g++-4.4.2 -c -o bugtest.out -O2 bugtest.ii projects/odete/bugtest.cpp: In member function ‘bool http://wiiplay.net/internal-compiler/internal-compiler-error-segmentation-fault-11-freebsd.html There is no why. Related 1Segmentation fault when executing program compiled from x86 assembly?263What is a segmentation fault?1647Why doesn't GCC optimize a*a*a*a*a*a to (a*a*a)*(a*a*a)?-1Segmentation fault due to pointer in gcc16Internal compiler error : segmentation fault Report a bug This report contains Public information Edit Everyone can see this information. Internal Compiler Error Segmentation Fault Please Submit A Full Bug Report

I've circumvented the problem in my piece of software for now by going from -O2 to -O1, as I don't feel like rebuilding everything against 4.5 just yet. :) But at Adv Reply February 4th, 2009 #10 monkeyking View Profile View Forum Posts Private Message Grande Half-n-Half Cinnamon Ubuntu Join Date Apr 2005 Beans 849 Re: gcc: Internal error: Segmentation fault Also: what does the preprocessed source look like? –stefan Apr 4 '14 at 8:58 Inly can use this gcc version. check over here Why aren't sessions exclusive to an IP address?

PHP Code: cathello.c
#include

voidmain()
{
printfCould you try to invoke gcc using this more explicit command?/usr/bin/gcc sourcefile.c -o helloworld.

Flour shortage in baking How do you grow in a skill when you're the company lead in that area? Heisenberg's Uncertainty Principle Standardisation of Time in a FTL Universe Are ability modifiers/sneak attacks multiplied in a critical hit? That's it. This is free software; see the source for copying conditions.

Bravo For Buckets! Fresh 2.x repository clone at revision r2722 (same problem with official releases or previous revisions) same for 3.x Windows 7 or XP Please provide any additional information below. I suspect something is wrong with the binaries installed on your system - possibly because of the symbolic link you created. http://wiiplay.net/internal-compiler/internal-compiler-error-segmentation-fault-cygwin.html Tango Icons Tango Desktop Project.

Page 1 of 3 123 Last Jump to page: Results 1 to 10 of 27 Thread: gcc: Internal error: Segmentation fault (program cc1) Thread Tools Show Printable Version Subscribe to this Comment 7 Marek Polacek 2015-09-21 13:38:16 UTC Looks resolved then. COLLECT_GCC=g++-4.5.0 COLLECT_LTO_WRAPPER=/home/oberlaen/local/stow/gcc-4.5.0/libexec/gcc/i486-linux-gnu/4.5.0/lto-wrapper Target: i486-linux-gnu Configured with: ../gcc-4.5.0/configure --prefix=/home/oberlaen/local/stow/gcc-4.5.0/ --with-bugurl=file:///usr/share/doc/gcc-4.5/README.Bugs --enable-languages=c,c++ --enable-shared --disable-multiarch --enable-linker-build-id --with-system-zlib --without-included-gettext --enable-threads=posix --program-suffix=-4.5.0 --enable-nls --enable-clocale=gnu --enable-libstdcxx-debug --enable-objc-gc --enable-targets=all --disable-multilib --disable-werror --with-arch-32=i486 --with-tune=generic --enable-checking=release --build=i486-linux-gnu --host=i486-linux-gnu --target=i486-linux-gnu --with-mpc=/home/oberlaen/local Re: gcc: Internal error: Segmentation fault (program cc1) I don't see what running ldd on the gcc binary will do, since gcc is little more than a frontend.

If that does not work, please also provide the output of apt-cache policy gcc-4.6 and ls -l /usr/bin/gcc in your question. –gertvdijk Jun 26 '13 at 9:09 2 GCC package Finding Signs of Life from afar Make an ASCII bat fly around an ASCII moon Flour shortage in baking Were students "forced to recite 'Allah is the only God'" in Tennessee I am unable to reproduce this using the exact same gcc version and the source you provided - binary returns "Hello World!" as expected. The question remains, what is going wrong with my various 4.4.x tests, and why did it work for Jonathan?

Description je.suis.bon 2013-06-15 16:47:53 UTC Created attachment 30308 [details] libgcc2.c I was attempting to build gcc 4.7.2 using gcc 4.8.1. more hot questions question feed about us tour help blog chat data legal privacy policy work here advertising info mobile contact us feedback Technology Life / Arts Culture / Recreation Science Matthias Klose (doko) wrote on 2008-09-08: #6 > Please submit a full bug report. > See for instructions. > For Debian GNU/Linux specific bug reporting instructions, see > . My Machine is a ThinkPad T42 with a Pentium M (Dothan) 1.7GHz.