Home > Internal Compiler > Internal Compiler Error Internal Consistency Failure

Internal Compiler Error Internal Consistency Failure

Loaded symbols for /usr/lib/pa20_64/libdl.1 Reading symbols from /opt/graphics/OpenGL/lib/pa20_64/libogltls.sl...done. Perhaps it's time to > upgrade. warning: The shared libraries were not privately mapped; setting a breakpoint in a shared library will not work until you rerun the program. Already have an account? check over here

zkessin commented Jan 14, 2014 I will check and fix it Sign up for free to join this conversation on GitHub. Only cross-compiling for ARM exhibits this problem (native compile is actually ok), and the issue can be circumvented by disabling the zmbv encoder at the configure stage. sub_dir /home/david/temp/ChicagoBoss/deps/mochicow already associated with /home/david/temp/ChicagoBoss. risq commented Jun 23, 2016 Hi, I got a similar error on erlang 19, elixir 1.2.6, if that helps you : ==> combine Compiled lib/combine/parser_state.ex Compiled lib/combine/helpers.ex Compiled lib/combine.ex Compiled lib/combine/parsers/binary.ex their explanation

I will try to do so. The minimal case required to trigger it is a lot simpler than I would've guessed, it should definitely be trivial to port that to Erlang and see if it happens there Comment 2 John David Anglin 2007-09-06 13:30:28 UTC No, cc1 is hanging in stage2. Loaded symbols for /usr/lib/pa20_64/dld.sl Reading symbols from /usr/lib/pa20_64/libc.2...done.

  1. I'm compiling for Synology NAS embedded systems that have multiple CPU architectures, using their various GCC toolchains available here: ​http://sourceforge.net/projects/dsgpl/files/DSM%204.1%20Tool%20Chains/ Cross-compiling using their Intel toolchain is fine, so is cross-compiling for
  2. Format For Printing -XML -Clone This Bug -Top of page Home | New | Browse | Search | [?] | Reports | Help | NewAccount | Log In Remember [x] |
  3. I have created different modules for each solution working around the compiler issue.
  4. The PR requires (unless there is a subsequent change) rerunning the testsuite.
  5. I've only just found time to look at it again.
  6. Reading symbols from /usr/lib/pa20_64/dld.sl...done.

comment:5 in reply to: ↑ 4 Changed 4 years ago by cehoyos Replying to patters: I'll pass a link to this page to the toolchain maintainer. comment:4 follow-up: ↓ 5 Changed 4 years ago by patters Thanks for the tips. See for instructions. Loaded symbols for /opt/graphics/OpenGL/lib/pa20_64/libogltls.sl #0 0x400000000042cc00 in verify_rtl_sharing () at ../../gcc/gcc/emit-rtl.c:2382 2382 if (INSN_P (p)) Breakpoint 1 at 0x40000000003c94d4: file ../../gcc/gcc/diagnostic.c, line 655.

Thanks, -- Mark Comment 5 John David Anglin 2007-10-10 23:01:37 UTC Fixed. Perhaps it's time to upgrade. Hope it helps to narrow down the issue and/or create a pure Erlang module with that error. — You are receiving this because you commented. http://r.789695.n4.nabble.com/R-2-15-compile-error-fatal-error-internal-consistency-failure-td4566026.html On Elixir 1.3.0 and Erlang 19.0 I get == Compilation error on file lib/combine/parsers/text.ex == ** (CompileError) Elixir.Combine.Parsers.Text: function float_impl/1+43: Internal consistency check failed - please report this bug.

Terms Privacy Security Status Help You can't perform that action at this time. No, thanks [Rd] R-2.15 compile error: fatal error: internal consistency failure This message: [ Message body ] [ More options ] Related messages: [ Next message ] [ Previous message ] Terms Privacy Security Status Help You can't perform that action at this time. I had wanted to, but never managed to create an erlang test case.

We recommend upgrading to the latest Safari, Google Chrome, or Firefox. Personal Open source Business Explore Sign up Sign in Pricing Blog Support Search GitHub This repository Watch 139 Star 1,602 Fork 293 ChicagoBoss/ChicagoBoss Code Issues 57 Pull requests 6 Projects But then so are the lapack sources, and that file is unchanged since 2006 (and R compiled on Linux perfectly well over those years). A different solution was to change the function called inside the case to not use binary pattern matching.

make: *** [libavcodec/zmbvenc.o] Error 1 I don't think there is anything the FFmpeg developers can do. http://wiiplay.net/internal-compiler/internal-compiler-error-gcc.html bitwalker referenced this issue Jun 24, 2016 Closed Erlang 19 Compilation Error #18 mneudert commented Jul 20, 2016 • edited Hey there, I also got aware of this bug and was Duncan Murdoch ______________________________________________ [hidden email] mailing list https://stat.ethz.ch/mailman/listinfo/r-devel Prof Brian Ripley Threaded Open this post in threaded view ♦ ♦ | Report Content as Inappropriate ♦ ♦ Re: R-2.15 compile Owner bitwalker commented Jun 24, 2016 Definitely seems related to the usage within a macro, though I'm not clear on why that would fail when the same thing outside a macro

I > am running Centos 5.5, in particular, the following > > $ more /proc/version > Linux version 2.6.18-194.el5 (mockbuild at builder10.centos.org) (gcc version > 4.1.2 20080704 (Red Hat 4.1.2-48)) #1 Replacing a _ match with a name and then sending it to IO.puts/1 also helped (variable name only had no effect). Description John David Anglin 2007-09-05 21:15:53 UTC /test/gnu/gcc/objdir/./prev-gcc/xgcc -B/test/gnu/gcc/objdir/./prev-gcc/ -B/opt/g nu64/gcc/gcc-4.3.0/hppa64-hp-hpux11.11/bin/ -c -g -O2 -DIN_GCC -W -Wall -Wwr ite-strings -Wstrict-prototypes -Wmissing-prototypes -Wold-style-definition -Wmi ssing-format-attribute -pedantic -Wno-long-long -Wno-variadic-macros -Wno-overlength-strings -Werror -fno-common -DHAVE_CONFIG http://wiiplay.net/internal-compiler/internal-compiler-error-cl-exe.html You can try turning off optimization on selected source files until you find the one (hopefully) that, when compiled with optimization, causes the error.

Is there a typical thing to look for that would behave differently on native Vs cross compile? bmchenry Fri, 08/14/2009 - 07:23 GO NAVY! (had to do that, my daughter is 05 USNA Grad!)i am guessing it is related to something the Optimizer is doing.In your Release setup, Only in 19.0.

I did a core dump: Program terminated with signal 3, Quit.

antipax commented Jun 24, 2016 I believe I have narrowed down the issue to this commit: erlang/[email protected] antipax commented Jun 24, 2016 Here's the abstract code for the version with line: Already have an account? Owner bitwalker commented Jul 21, 2016 @mneudert Nice work! Breakpoint 2 at 0x40000000003c92b4: file ../../gcc/gcc/diagnostic.c, line 599.

Free forum by Nabble Edit this page Skip to main content Developer Zone Join today Log in DevelopmentOSAndroid*Chrome*HTML5Windows*Device2-in-1 & Ultrabook™Business ClientEmbedded SystemsIoTServer, Workstation, HPCTechnologyBig DataDual ScreenGame DevIntel® RealSense™ISA ExtensionsMachine LearningModern CodeNetworkingOpen I configured it without problems with options that i used many times before ./configure --prefix=/home/andre/R-2.15.0 --enable-byte-compiled-packages=no --with-tcltk --enable-R-shlib=yes Then when i started making it, it died while making lapack, particularly on You seem to have CSS turned off. http://wiiplay.net/internal-compiler/internal-compiler-error-net.html Bug33318 - [4.3 Regression] fortran/expr.c:305: internal compiler error: internal consistency failure Summary: [4.3 Regression] fortran/expr.c:305: internal compiler error: internal consis...

You signed in with another tab or window. I configured it without problems >> with options that i used many times before >> >> ./configure --prefix=/home/andre/R-2.15.0 >> --enable-byte-compiled-packages=no --with-tcltk --enable-R-shlib=yes >> Then when i started making it, it died I found the bug. I might see if a lower optimization level would work. > > Duncan Murdoch > > ______________________________________________ > [hidden email] mailing list > https://stat.ethz.ch/mailman/listinfo/r-devel-- Brian D.

Instruction: {call,4,{f,129}} Error: {multiple_match_contexts,[{x,0},1]}: (stdlib) lists.erl:1338: :lists.foreach/2 (stdlib) erl_eval.erl:670: :erl_eval.do_apply/6 RobinClowers changed the title from Internal Consistency Error to Internal consistency error Jun 23, 2016 aaronjensen commented Jun 23, 2016 @josevalim josevalim commented Jun 23, 2016 Thanks @adamkittelson! If you want to work on this issue, try to find the function (or line) in zmbvenc.c that causes the internal compiler error, a work-around might be possible and theoretically acceptable. Visit the Trac open source project athttp://trac.edgewall.org/ R › R devel Search everywhere only in this topic Advanced Search R-2.15 compile error: fatal error: internal consistency failure ‹ Previous Topic Next

GCC Bugzilla – Bug33318 [4.3 Regression] fortran/expr.c:305: internal compiler error: internal consistency failure Last modified: 2007-10-10 23:01:37 UTC Home | New | Browse | Search | [?] | Reports | Help Please read the posting guide before posting to the list. You signed out in another tab or window. Note: See TracTickets for help on using tickets.

Please don't fill out this field. If I set /traceback and /check:pointer in release mode all seems to work well also. Loaded symbols for /lib/pa20_64/libc.2 Reading symbols from /usr/lib/pa20_64/libdl.1...done. Sign in to comment Contact GitHub API Training Shop Blog About © 2016 GitHub, Inc.