Home > Internal Compiler > Internal Compiler Error In Splice_child_die At Dwarf2out.c

Internal Compiler Error In Splice_child_die At Dwarf2out.c

Personal Open source Business Explore Sign up Sign in Pricing Blog Support Search GitHub This repository Watch 18 Star 245 Fork 18 CE-Programming/CEmu Code Issues 10 Pull requests 0 Projects So it is most likely already fixed. Called from cc1plus via #4 0x00000000009e9d25 in dwarf2out_type_decl (decl=0x7ffff5b86450, local=0) at /space/rguenther/src/svn/trunk/gcc/dwarf2out.c:21985 21985 dwarf2out_decl (decl); (gdb) #5 0x0000000000cd1e8c in rest_of_type_compilation (type=0x7ffff5b7f7e0, toplev=1) at /space/rguenther/src/svn/trunk/gcc/passes.c:230 230 debug_hooks->type_decl (TYPE_STUB_DECL (type), !toplev); (gdb) #6 I now get the ICE at output_die (already \ > reported) but also new > /abuild/jh/trunk-install/bin/g++ -flto=24 -fuse-linker-plugin -o dump_syms > -fno-rtti -fno-exceptions -Wall -Wpointer-arith -Woverloaded-virtual -Wsynth > -Wno-ctor-dtor-privacy -Wno-non-virtual-dtor -Wcast-align weblink

The version of libboost-python in Ubuntu Saucy is 1.53. Comment 8 Dirk Mueller 2005-10-12 21:12:47 UTC SVN commit 469980 by mueller: workaround compiler bug in gcc 3.3.x CCMAIL: 114261-done@bugs.kde.org M +11 -0 collectionreader.cpp --- trunk/extragear/multimedia/amarok/src/collectionreader.cpp #469979:469980 @@ -188,6 +188,17 @@ Now it would be interesting to bisect what fixed this on the trunk ... > /space/rguenther/install/gcc-4.8.2/bin/g++ t.ii -g -flto -r -nostdlib -flto-partition=none t.ii: In function 'void fn1()': t.ii:147:25: warning: deprecated conversion g++-fsf-4.7 -dynamiclib -Ofast -funroll-loops -g -flto -fdefault-integer-8 -flat_namespace -undefined suppress -single_module noePot.o atomProb.o rdcPot1.o csaPot.o jCoupPot.o shapePot.o atomDensity.o probDistPot.o cosRatioPot.o ncsPot.o prePot.o rdcWavePot.o varTensor.o surfaceArea.o psolPot.o orderPot.o posRMSDPot.o utils.o posSymmPot.o sphereFun.o More Bonuses

For the remaining object file inputs (AFAIK only python_scripter.o?) please attach preprocessed source from the compile-stage. And yes, reducing the testcase to a few input files is necessary - you can bisect the linker inputs by adding -r -nostdlibs (performing a partial link). But we happily enter them into symtab merging and so we ICE.

Follow-Ups: [Bug debug/48354] internal compiler error: in splice_child_die, at dwarf2out.c:8064 From: rguenth at gcc dot gnu.org Index Nav: [DateIndex] [SubjectIndex] [AuthorIndex] [ThreadIndex] Message Nav: [DatePrev][DateNext] [ThreadPrev][ThreadNext] [prev in list] [next in You signed in with another tab or window. Format For Printing -XML -Clone This Bug -Top of page Home | New | Browse | Search | [?] | Reports | Help | NewAccount | Log In Remember [x] | You can now further reduce the single testfile by following the "Simple ICE reduction" section in the document I've linked to above.

Delta for me ended already 10 times with message that: "Could not increase granularity; we are done." And after each new start it removes a few more lines. See for instructions. Removing the -g3 should allow it to work. 👍 1 🎉 1 jacobly0 closed this Sep 15, 2016 Sign up for free to join this conversation on GitHub. https://gcc.gnu.org/ml/gcc-bugs/2013-12/msg00530.html Hohumm.

What can I do next please? OPM member bska commented Jun 3, 2013 I don't know what causes the symptoms @andlaus is seeing. Using built-in specs. just curious...) OPM member rolk commented Jun 25, 2013 LTO is now disabled by default as of OPM/opm-core#258; this will reach opm-autodiff in the next CMake rollup.

Has anyone done what the error plainly says to do - report it to SUSE? https://gcc.gnu.org/ml/gcc-bugs/2011-03/msg03131.html Comment 13 Richard Biener 2011-06-01 13:49:47 UTC Created attachment 24407 [details] another update Try this instead. This may or may not be a duplicate of bug 46135. Lu 2011-04-25 04:17:21 UTC It is caused by revision 170321: http://gcc.gnu.org/ml/gcc-cvs/2011-02/msg00866.html Comment 4 Richard Biener 2011-05-24 14:21:57 UTC In the cc1plus case the type for s is already output and we

Thank you. have a peek at these guys lto-wrapper: g++-fsf-4.7 returned 1 exit status collect2: error: lto-wrapper returned 1 exit status Comment 16 Jack Howarth 2011-11-02 18:08:37 UTC The original test case still fails on x86_64-apple-darwin11 as well at Can try, but only after returning from Bertinoro. The scope blocks look the same for cc1plus and lto1: { Scope block 0x7ffff5b42058#2 typedef struct Dummy Dummy; (unused) struct S s; (unused) } One difference is that cc1plus sees DECL_ORIGINAL_TYPE

I also seem to remember that the gimple.c change has issues during LTO bootstrap for some reason. Reload to refresh your session. Index Nav: [DateIndex] [SubjectIndex] [AuthorIndex] [ThreadIndex] Message Nav: [DatePrev][DateNext] [ThreadPrev][ThreadNext] This is the mail archive of the [email protected] mailing list for the GCC project. http://wiiplay.net/internal-compiler/internal-compiler-error-in-dwarf2out-finish-at-dwarf2out-c.html Index Nav: [DateIndex] [SubjectIndex] [AuthorIndex] [ThreadIndex] Message Nav: [DatePrev][DateNext] [ThreadPrev][ThreadNext] Other format: [Raw text] [Bug lto/48354] New: internal compiler error: in splice_child_die, at dwarf2out.c:8064 From: "wouter.vermaelen at scarlet dot be"

Thank you. Thank you. It at least misses walking DECL_ORIGINAL_TYPE in free-lang-data.

lto-wrapper: /usr/bin/c++ returned 1 exit status /usr/bin/ld: lto-wrapper failed collect2: error: ld returned 1 exit status You need CMake, libicu-dev, python3-dev and libboost-python-dev to compile the library.

Seems to work on the trunk, worked with > > 4.6.4. > > > > Now it would be interesting to bisect what fixed this on the trunk ... > > Comment 6 Richard Biener 2011-05-24 14:58:53 UTC It seems that we can pull in types via that link that have function-decls in them (methods) that do not have an assembler name We recommend upgrading to the latest Safari, Google Chrome, or Firefox. I have not tried to reproduce David Kredba's issue so that might still remain.

Comment 17 David Kredba 2013-12-09 19:56:29 UTC Thank you! Description jpakkane 2013-08-27 12:01:57 UTC With Gcc 4.8.1 on Ubuntu Saucy x86-64 I can reliably trigger an ICE. Seems to work on the trunk, worked with 4.6.4. this content OPM member bska commented Jun 3, 2013 As far as I can tell, this is a compiler issue--not a problem with the OPM-Autodiff code base per se.

Sign in to comment Contact GitHub API Training Shop Blog About © 2016 GitHub, Inc. I thought it was disabled... Though the testcase looks very different. Error: g++ -DHAVE_CONFIG_H -I./amarok/src -I/razno/Kriko/Appz/Amarok/Amaroksvn/amarokFromSvn/multimedia/amarok/src -I. -I./amarok/src/amarokcore -I/razno/Kriko/Appz/Amarok/Amaroksvn/amarokFromSvn/multimedia/amarok/src/amarokcore -I/razno/Kriko/Appz/Amarok/Amaroksvn/amarokFromSvn/multimedia/amarok/src/analyzers -I/razno/Kriko/Appz/Amarok/Amaroksvn/amarokFromSvn/multimedia/amarok/src/engine -I/razno/Kriko/Appz/Amarok/Amaroksvn/amarokFromSvn/multimedia/amarok/src/plugin -I/razno/Kriko/Appz/Amarok/Amaroksvn/amarokFromSvn/multimedia/amarok/src/statusbar -I/opt/kde3/include/arts -I/usr/local/include/taglib -I/razno/Kriko/Appz/Amarok/Amaroksvn/amarokFromSvn/multimedia/amarok/src/sqlite -I/opt/kde3/include -I/usr/lib/qt3/include -I/usr/X11R6/include -DQT_THREAD_SUPPORT -D_REENTRANT -Wno-long-long -Wundef -ansi -D_XOPEN_SOURCE=500 -D_BSD_SOURCE -Wcast-align -Wconversion -Wchar-subscripts -Wall -W -Wpointer-arith

Comment 11 David Kredba 2013-12-08 22:01:14 UTC Delta died after more than 200000 iterations. First try to minimize the gcc command line options that you use. lto-wrapper: fatal error: g++ returned 1 exit status compilation terminated. /usr/bin/ld: error: lto-wrapper failed collect2: error: ld returned 1 exit status Makefile:366: recipe for target 'CEmu' failed make: *** [CEmu] Error No, that's another expected one.

Seems to work on the trunk, worked with 4.6.4. S_ISDIR ( statBuf.st_mode) || m_processedDirs.find(de) != -1 ) { + if ( ! See for instructions. Looks like they are not overweighting it at the Creduce web site, it is way better then delta.

It may just be that LTO is sufficiently unstable that it should not be enabled by default in any OPM modules. make[6]: *** [/tmp/ccaKinu0.ltrans21.ltrans.o] Error 1 Shall I try to get testcase? Preprocessed source stored into /tmp/ccFVghiH.out file, please attach this to your bugreport. bug.ii:11:1: internal compiler error: in splice_child_die, at dwarf2out.c:8064 ...

You signed out in another tab or window. LOCAL_CLASS_P (t)); not doing that does not make us ICE the same way from cc1plus but we are outputting the type then via the Dummy typedef instead. test $? = 0; then exit 1 fi and run delta, multidelta or Creduce with it. org> Date: 2011-06-01 8:55:54 Message-ID: bug-48354-4-MOFVN8dfO7 () http !