Home > Internal Compiler > Internal Compiler Error Gcc

Internal Compiler Error Gcc

Contents

I just changed /etc/dphys-swapfile to give myself 1.5 gigs of swap and it worked. Reload to refresh your session. Travis CI member roidrage commented Feb 17, 2014 It could very well be a memory issue. This will mean fewer parallel jobs and will mean the compilation will take longer but hopefully will not exhaust your system memory. weblink

What would You-Know-Who want with Lily Potter? Thanks! I've set up a couple of Precise VMs (both 32 and 64 bit) and can't reproduce the problem there. Is it legal to bring board games (made of wood) to Australia?

Internal Compiler Error Gcc

How to photograph distant objects (10km)? We recommend upgrading to the latest Safari, Google Chrome, or Firefox. Thank you for the topic/solution! error: command 'gcc' failed with exit status 4 rhyolight self-assigned this Feb 4, 2015 Numenta member rhyolight commented Feb 4, 2015 A few questions: what version of NuPIC are you using?

  1. This takes almost 24 hours to build anyway, I don't have an accurate figure because I wasn't sitting in front of it.I'm enjoying throwing things at this little guy to see
  2. Already have an account?
  3. To verify have a look in /var/log/messages.You options then become.1) Try to increase the amount of memory available on the Raspberry Pi while you are compiling.
  4. They may be unsafe, untrustworthy, or illegal in your jurisdiction.
  5. We recommend upgrading to the latest Safari, Google Chrome, or Firefox.
  6. But it isn't really, the problem is the OS killed cc1plus, rather than it crashed.
  7. Error still persists, here is some additional info regarding my installed packages/versions, hope this helps!
  8. The Player.cpp in WOLTK is quite diferent in Cataclysm, and the erros is cleary: c++: internal compiler error: Killed (program cc1plus) Internal Compiler Erro, did you understand ?
  9. I presume you're not allowing anywhere near that sort of memory load.

Setting up libbz2-dev:amd64 (1.0.6-4) ... TrinityCore member DDuarte commented Jul 14, 2013 Dismissed? Triggering it more frequently slowd down the proces so much the build ends up timing out. Swapon Failed: Operation Not Permitted Thanks for your information! Sign up for free to join this conversation on GitHub.

There's a lot I can shut down, I never realized that was the problem. Reload to refresh your session. Should a spacecraft be launched towards the East? https://github.com/travis-ci/travis-ci/issues/1972 Setting up git-core (1:1.7.10.4-1ubuntu1) ...

but did the job. 512MB ram was not enough, my swapfile was 4GB (more than enough I guess). Sign up for free to join this conversation on GitHub. Ubuntu Add Swap Keyboard shortcut to search for text in MS Outlook 2007 Why was the identity of the Half-Blood Prince important to the story? Reload to refresh your session. We recommend upgrading to the latest Safari, Google Chrome, or Firefox.

C++ Internal Compiler Error Segmentation Fault (program Cc1plus)

Setting up zlib1g-dev:amd64 (1:1.2.7.dfsg-13) ... Setting up build-essential (11.5ubuntu3) ... Internal Compiler Error Gcc Personal Open source Business Explore Sign up Sign in Pricing Blog Support Search GitHub This repository Watch 192 Star 4,987 Fork 448 travis-ci/travis-ci Code Issues 1,124 Pull requests 0 Projects Gcc Internal Compiler Error Killed (program Cc1) You signed out in another tab or window.

reinstalling os.. have a peek at these guys I'm trying to run this command: if [ "$CXX" = "g++" ]; then echo "using gcc : 4.8 : g++-4.8 ;" > ~/user-config.jam; fi But the yaml parser complains about the When I repeat this with a later version of gcc (4.8.1) I get the following: Command being timed: "../bjam -a toolset=gcc" User time (seconds): 226.46 System time (seconds): 14.13 Percent of Already have an account? Increase Swap Space Raspberry Pi

Consider this closed then, and again, apologies for the stupidity :-) grahamracklot closed this Jul 15, 2013 ghost commented Jul 15, 2013 Do not worry, no one was born with wisdom If the process that is killed is cc1plus, gcc (perhaps incorrectly) interprets this as the process crashing and hence assumes that it must be a compiler bug. Flour shortage in baking Why mount doesn't respect option ro Building a model to help me determine parameters of a physical water filter? http://wiiplay.net/internal-compiler/internal-compiler-error-net.html KayEss commented Feb 19, 2014 I did another test across the whole library: Command being timed: "../bjam -a toolset=gcc" User time (seconds): 161.29 System time (seconds): 10.86 Percent of CPU this

See how many compilers it's starting and how big the RSS of the compiler process gets. Increase Swap Space Ubuntu Is that cpp file a complex/big one? Maybe it'd be worth installing gcc 4.8 on our current systems for the time being?

Advertise here. 1476835279 Hero Member Offline Posts: 1476835279 Ignore 1476835279 1476835279 #2 1476835279 Report to moderator 1476835279 Hero Member Offline Posts: 1476835279 Ignore 1476835279 1476835279 #2 1476835279 Report to moderator GoldenWings91

How would I have used an external disk with this? asked 1 year ago viewed 2857 times active 8 months ago Blog Stack Overflow Podcast #91 - Can You Stump Nick Craver? Setting up zip (3.0-6) ... Vagrant Increase Memory Setting up unzip (6.0-7ubuntu1) ...

Reload to refresh your session. Travis CI member roidrage commented Feb 18, 2014 Looks to be around 1 GB. High School Trigonometric Integration more hot questions question feed lang-c about us tour help blog chat data legal privacy policy work here advertising info mobile contact us feedback Technology Life / http://wiiplay.net/internal-compiler/internal-compiler-error-cl-exe.html Skip to content Ignore Learn more Please note that GitHub no longer supports old versions of Firefox.

In all three projects I've put up so far I get a consistent g++ crash in one file. Re: g++: internal compiler error: Killed (program cc1plus) September 29, 2013, 04:42:40 AM  #3 I agree with GoldenWings91. In car driving, why does wheel slipping cause loss of control? I just replicated the exact same error you had on Ubuntu following the wiki instructions exactly.

Please increase your swap space. Sign up for free to join this conversation on GitHub. The one that scores the highest gets killed by the operating system to free up memory. The problem above occurs when your system runs out of memory. TrinityCore member Aokromes commented Jul 15, 2013 Linking CXX executable worldserver [100%] Built target worldserver real 26m16.420s user 22m6.127s sys 3m14.860s [[email protected] bin434]$ gcc --version gcc (GCC) 4.8.1 20130603 (Red Hat

make[2]: *** [gnuradio-core/src/lib/swig/CMakeFiles/_gnuradio_core_general.dir/gnuradio_core_generalPYTHON_wrap.cxx.o] Error 1 make[1]: *** [gnuradio-core/src/lib/swig/CMakeFiles/_gnuradio_core_general.dir/all] Error 2 make: *** [all] Error 2 Comment 2 Jonathan Wakely 2013-02-01 23:30:57 UTC (In reply to comment #1) > ERROR: Internal error: This was referenced May 27, 2015 Open sporadic failures with travis "g++: internal compiler error: Killed (program cc1plus)" kashefy/elm#60 Open get travis-ci to build and run models stan-dev/example-models#26 Merged WIP: CI make[3]: *** [ycm/CMakeFiles/ycm_core.dir/ycm_core.cpp.o] Error 4 make[2]: *** [ycm/CMakeFiles/ycm_core.dir/all] Error 2 make[1]: *** [ycm/CMakeFiles/ycm_support_libs.dir/rule] Error 2 make: *** [ycm_support_libs] Error 2 Traceback (most recent call last): File "./build.py", line 196, in Main() What is the meaning of this sentence and why did the Giant rip open his belly?

Reload to refresh your session. KayEss commented Feb 18, 2014 Not really so by the standards of these projects. It is now reaching past 30% compiling.