Home > Internal Compiler > Internal Compiler Error Bus Error Xcode 4

Internal Compiler Error Bus Error Xcode 4

I've looked at this question, but I'm not making that mistake, and when it comes up I can usually fix it by adding some random lines of code somewhere. Everything was being done absolutely identical to how the other arrays were being done so why it was a problem this time is something I don't yet understand. If you want to distribute builds, use a distribution .mozconfig instead. Has anyone found a work around? @wisolith, I think you meant OSX: 10.11.3? weblink

EDIT: I KNOW that I tried this before, but setting the compiler to GCC instead of LLVM GCC successfully compiled the app. Sign up for the SourceForge newsletter: I agree to receive quotes, newsletters and other information from sourceforge.net and its partners regarding IT services and products. What are the legal consequences for a tourist who runs out of gas on the Autobahn? What is the exchange interaction?

I suspect this question will be closed quickly otherwise and then you won't get an answer –griegs Aug 12 '11 at 4:41 Sorry everyone, Im just panicking. Get first N elements of parameter pack Can I get a `du` grouped by month? more hot questions question feed default about us tour help blog chat data legal privacy policy work here advertising info mobile contact us feedback Technology Life / Arts Culture / Recreation

See for instructions. You signed in with another tab or window. I'd suggest running sudo update-alternatives --config gcc again and setting the value back to the default one. more hot questions question feed about us tour help blog chat data legal privacy policy work here advertising info mobile contact us feedback Technology Life / Arts Culture / Recreation Science

Thanks Matthias If you would like to refer to this comment somewhere else in this project, copy and paste the following link: macKasper - 2011-03-29 Oops, sorry, please move topic UILabel *pointsLabel = [[UILabel alloc] initWithFrame:ptsFrame]; ... [self addSubview:pointsLabel]; [pointsLabel release]; UILabel *typeLabel = [[UILabel alloc] initWithFrame:typeFrame]; ... [self addSubview:pointsLabel]; [typeLabel release]; Notice in the second addSubview I added the pointsLabel share|improve this answer answered Aug 12 '11 at 6:44 Moshe 30.3k56209356 add a comment| Your Answer draft saved draft discarded Sign up or log in Sign up using Google Sign http://stackoverflow.com/questions/5042256/internal-compiler-error-bus-error EDIT: Another example: It happened again and I tracked it down to: [headerView centerViewVertically:milesLabel pixelsFromRight:pointLabel.frame.size.width + 20]; I changed it to: int x = pointLabel.frame.size.width; [headerView centerViewVertically:milesLabel pixelsFromRight:x + 20]; And

I still haven't figured out exactly what is causing the problem but it will compile for the simulator, but not for the device. That seems unlikely however since there are several [[array alloc] init] array setups being done before and after the one I was trying to add in. Maybe I'm allocating too much memory in too short a period or something? So I wrote a helloworld.c file and tried to compile that, but the compiler returned: gcc internal compiler error: Bus error (program as) The same error is also in my config.log

The default gcc for 14.04 is 4.8.4; your title mentions gcc-5 but the error messages from the configure script say gcc version 6.1.1 20160511 (Ubuntu 6.1.1-3ubuntu11~14.04.1). this contact form Not the answer you're looking for? As a workaround I did the following.... // declare a "internal" generic type to make it compile class _CustomRow: Row, SelectableRowType, RowType { ... } // use typealias to use share|improve this answer answered Sep 28 '11 at 8:25 damacri86 110211 add a comment| Your Answer draft saved draft discarded Sign up or log in Sign up using Google Sign

Not the answer you're looking for? http://wiiplay.net/internal-compiler/internal-compiler-error-gcc.html Bilan de l'opération : plus d'erreur Ca ressemble à du bug XCode 4.Sergio Retour en haut Retourner dans iOS, watchOS, tvOS: utilisation des classes Cocoa Touch 0 utilisateur(s) li(sen)t ce sujet What happens if one brings more than 10,000 USD with them into the US? It would be great if you can report it.

that did it. share|improve this answer answered Jun 27 '11 at 16:19 Aaron Goselin 570617 wow!!!. Retour en haut #3 Eddy58 Eddy58 Broyeur de fèves Membre 1 923 messages Location71 Posté 30 mai 2011 - 10:07 J'avais eu droit à cette erreur....déterrage de thread J'avais évité (je check over here Browse other questions tagged iphone objective-c ios animation compiler-construction or ask your own question.

Join them; it only takes a minute: Sign up Xcode 4 internal compiler error: bus error up vote 7 down vote favorite 1 Xcode 4.0.1 has started giving me an internal asked 5 years ago viewed 1500 times active 5 years ago Blog Stack Overflow Podcast #91 - Can You Stump Nick Craver? It was created by python configure 2.7, which was generated by GNU Autoconf 2.69.

Just review your code and look fr the syntax error.

Is there a workaround? share|improve this answer edited May 27 '11 at 14:56 DarthJDG 13.4k33150 answered May 26 '11 at 18:47 Alex 111 add a comment| up vote 1 down vote I just had this Plausibility of the Japanese Nekomimi Why did Moody eat the school's sausages? Does anyone know this encoding?

COLLECT_GCC=gcc COLLECT_LTO_WRAPPER=/usr/lib/gcc/x86_64-linux-gnu/4.8/lto-wrapper Target: x86_64-linux-gnu Configured with: ../src/configure -v --with-pkgversion='Ubuntu 4.8.5-2ubuntu1~14.04.1' --with-bugurl=file:///usr/share/doc/gcc-4.8/README.Bugs --enable-languages=c,c++,java,go,d,fortran,objc,obj-c++ --prefix=/usr --program-suffix=-4.8 --enable-shared --enable-linker-build-id --libexecdir=/usr/lib --without-included-gettext --enable-threads=posix --with-gxx-include-dir=/usr/include/c++/4.8 --libdir=/usr/lib --enable-nls --with-sysroot=/ --enable-clocale=gnu --enable-libstdcxx-debug --enable-libstdcxx-time=yes --enable-gnu-unique-object --disable-libmudflap --enable-plugin --with-system-zlib --disable-browser-plugin Assembly stopping. ** BUILD FAILED ** make[6]: *** [libs] Error 1 make[5]: *** [libs] Error 2 make[4]: *** [libs_tier_app] Error 2 make[3]: *** [tier_app] Error 2 make[2]: *** [alldep] Error 2 What would You-Know-Who want with Lily Potter? this content Previous company name is ISIS, how to list on CV?